Reaction Details
TargetMitogen-activated protein kinase 3
LigandBDBM50001733
Substrate/Competitorn/a
Meas. Tech.ChEMBL_1337682 (CHEMBL3242870)
IC50>10000±n/a nM
Citation Mahmoud, KAKrug, MWersig, TSlynko, ISchächtele, CTotzke, FSippl, WHilgeroth, A Discovery of 4-anilinoa-carbolines as novel Brk inhibitors. Bioorg Med Chem Lett24:1948-51 (2014) 
 
Mitogen-activated protein kinase 3
Name:Mitogen-activated protein kinase 3
Type:Protein
Mol. Mass.:43136.58
Organism:Homo sapiens (Human)
Description:curated by PDB 4QTB
Residue:379
BDBM50001733
NameBDBM50001733
Synonyms:CHEMBL3133821
TypeSmall organic molecule
Emp. Form.C17H13N3O
Mol. Mass.275.3046
SMILESOc1cccc(Nc2ccnc3[nH]c4ccccc4c23)c1