Reaction Details
TargetProtein-tyrosine kinase 6
LigandBDBM50001736
Substrate/Competitorn/a
Meas. Tech.ChEMBL_1337320 (CHEMBL3241182)
IC50 41±n/a nM
Citation Mahmoud, KAKrug, MWersig, TSlynko, ISchächtele, CTotzke, FSippl, WHilgeroth, A Discovery of 4-anilinoa-carbolines as novel Brk inhibitors. Bioorg Med Chem Lett24:1948-51 (2014) 
 
Protein-tyrosine kinase 6
Name:Protein-tyrosine kinase 6
Type:Tyrosine-protein kinase
Mol. Mass.:51839.11
Organism:Homo sapiens (Human)
Description:n/a
Residue:451
BDBM50001736
NameBDBM50001736
Synonyms:CHEMBL3238096
TypeSmall organic molecule
Emp. Form.C24H19N3O
Mol. Mass.365.4272
SMILESC(Oc1cccc(Nc2ccnc3[nH]c4ccccc4c23)c1)c1ccccc1