Reaction Details
TargetProtein-tyrosine kinase 6
LigandBDBM50001737
Substrate/Competitorn/a
Meas. Tech.ChEMBL_1337320 (CHEMBL3241182)
IC50 44±n/a nM
Citation Mahmoud, KAKrug, MWersig, TSlynko, ISchächtele, CTotzke, FSippl, WHilgeroth, A Discovery of 4-anilinoa-carbolines as novel Brk inhibitors. Bioorg Med Chem Lett24:1948-51 (2014) 
 
Protein-tyrosine kinase 6
Name:Protein-tyrosine kinase 6
Type:Tyrosine-protein kinase
Mol. Mass.:51839.11
Organism:Homo sapiens (Human)
Description:n/a
Residue:451
BDBM50001737
NameBDBM50001737
Synonyms:CHEMBL3238091
TypeSmall organic molecule
Emp. Form.C21H17N3
Mol. Mass.311.3798
SMILESC1C=CCc2cc(Nc3ccnc4[nH]c5ccccc5c34)ccc12