Reaction Details
TargetCarbonic anhydrase 1
LigandBDBM50442522
Substrate/Competitorn/a
Meas. Tech.ChEMBL_1337724 (CHEMBL3240043)
IC50>10000±n/a nM
Citation Tauro, MLoiodice, FCeruso, MSupuran, CTTortorella, P Arylamino bisphosphonates: potent and selective inhibitors of the tumor-associated carbonic anhydrase XII. Bioorg Med Chem Lett24:1941-3 (2014) 
 
Carbonic anhydrase 1
Name:Carbonic anhydrase 1
Type:Enzyme
Mol. Mass.:28873.37
Organism:Homo sapiens (Human)
Description:P00915
Residue:261
BDBM50442522
NameBDBM50442522
Synonyms:CHEMBL2440581
TypeSmall organic molecule
Emp. Form.C7H10FNO6P2
Mol. Mass.285.1033
SMILESOP(O)(=O)C(Nc1ccc(F)cc1)P(O)(O)=O