Reaction Details
TargetCarbonic anhydrase 1
LigandBDBM50442514
Substrate/Competitorn/a
Meas. Tech.ChEMBL_1337724 (CHEMBL3240043)
IC50 5830±n/a nM
Citation Tauro, MLoiodice, FCeruso, MSupuran, CTTortorella, P Arylamino bisphosphonates: potent and selective inhibitors of the tumor-associated carbonic anhydrase XII. Bioorg Med Chem Lett24:1941-3 (2014) 
 
Carbonic anhydrase 1
Name:Carbonic anhydrase 1
Type:Enzyme
Mol. Mass.:28873.37
Organism:Homo sapiens (Human)
Description:P00915
Residue:261
BDBM50442514
NameBDBM50442514
Synonyms:CHEMBL2440435
TypeSmall organic molecule
Emp. Form.C8H10F3NO6P2
Mol. Mass.335.1108
SMILESOP(O)(=O)C(Nc1cccc(c1)C(F)(F)F)P(O)(O)=O