Reaction Details
TargetCarbonic anhydrase 1
LigandBDBM50442515
Substrate/Competitorn/a
Meas. Tech.ChEMBL_1337724 (CHEMBL3240043)
IC50 4570±n/a nM
Citation Tauro, MLoiodice, FCeruso, MSupuran, CTTortorella, P Arylamino bisphosphonates: potent and selective inhibitors of the tumor-associated carbonic anhydrase XII. Bioorg Med Chem Lett24:1941-3 (2014) 
 
Carbonic anhydrase 1
Name:Carbonic anhydrase 1
Type:Enzyme
Mol. Mass.:28873.37
Organism:Homo sapiens (Human)
Description:P00915
Residue:261
BDBM50442515
NameBDBM50442515
Synonyms:CHEMBL2440438
TypeSmall organic molecule
Emp. Form.C7H11NO7P2
Mol. Mass.283.1123
SMILESOc1ccc(NC(P(O)(O)=O)P(O)(O)=O)cc1