Reaction Details
TargetCarbonic anhydrase 2
LigandBDBM50442518
Substrate/Competitorn/a
Meas. Tech.ChEMBL_1337725 (CHEMBL3240045)
IC50>10000±n/a nM
Citation Tauro, MLoiodice, FCeruso, MSupuran, CTTortorella, P Arylamino bisphosphonates: potent and selective inhibitors of the tumor-associated carbonic anhydrase XII. Bioorg Med Chem Lett24:1941-3 (2014) 
 
Carbonic anhydrase 2
Name:Carbonic anhydrase 2
Type:Enzyme
Mol. Mass.:29250.71
Organism:Homo sapiens (Human)
Description:P00918
Residue:260
BDBM50442518
NameBDBM50442518
Synonyms:CHEMBL2440439
TypeSmall organic molecule
Emp. Form.C8H13NO6P2
Mol. Mass.281.1394
SMILESCc1ccc(NC(P(O)(O)=O)P(O)(O)=O)cc1