Reaction Details
TargetCarbonic anhydrase 9
LigandBDBM50442518
Substrate/Competitorn/a
Meas. Tech.ChEMBL_1337726 (CHEMBL3240046)
IC50>10000±n/a nM
Citation Tauro, MLoiodice, FCeruso, MSupuran, CTTortorella, P Arylamino bisphosphonates: potent and selective inhibitors of the tumor-associated carbonic anhydrase XII. Bioorg Med Chem Lett24:1941-3 (2014) 
 
Carbonic anhydrase 9
Name:Carbonic anhydrase 9
Type:Enzyme
Mol. Mass.:49669.03
Organism:Homo sapiens (Human)
Description:Catalytic domain of human cloned isozyme was used in the assay
Residue:459
BDBM50442518
NameBDBM50442518
Synonyms:CHEMBL2440439
TypeSmall organic molecule
Emp. Form.C8H13NO6P2
Mol. Mass.281.1394
SMILESCc1ccc(NC(P(O)(O)=O)P(O)(O)=O)cc1