Reaction Details
TargetCarbonic anhydrase 14
LigandBDBM50173799
Substrate/Competitorn/a
Meas. Tech.ChEMBL_1337728 (CHEMBL3240048)
IC50 911±n/a nM
Citation Tauro, MLoiodice, FCeruso, MSupuran, CTTortorella, P Arylamino bisphosphonates: potent and selective inhibitors of the tumor-associated carbonic anhydrase XII. Bioorg Med Chem Lett24:1941-3 (2014) 
 
Carbonic anhydrase 14
Name:Carbonic anhydrase 14
Type:Enzyme
Mol. Mass.:37665.67
Organism:Homo sapiens (Human)
Description:Human (cloned) isozyme.
Residue:337
BDBM50173799
NameBDBM50173799
Synonyms:(3-bromo-phenyl)-aminomethylene-1,1-bisphosphonate CHEMBL370662 | [(3-bromo-phenylamino)-phosphono-methyl]-phosphonic acid
TypeSmall organic molecule
Emp. Form.C7H10BrNO6P2
Mol. Mass.346.009
SMILESOP(O)(=O)C(Nc1cccc(Br)c1)P(O)(O)=O