Reaction Details
TargetCarbonic anhydrase 14
LigandBDBM50173796
Substrate/Competitorn/a
Meas. Tech.ChEMBL_1337728 (CHEMBL3240048)
IC50>10000±n/a nM
Citation Tauro, MLoiodice, FCeruso, MSupuran, CTTortorella, P Arylamino bisphosphonates: potent and selective inhibitors of the tumor-associated carbonic anhydrase XII. Bioorg Med Chem Lett24:1941-3 (2014) 
 
Carbonic anhydrase 14
Name:Carbonic anhydrase 14
Type:Enzyme
Mol. Mass.:37665.67
Organism:Homo sapiens (Human)
Description:Human (cloned) isozyme.
Residue:337
BDBM50173796
NameBDBM50173796
Synonyms:CHEMBL450938 | [(3-nitro-phenylamino)-phosphono-methyl]-phosphonic acid
TypeSmall organic molecule
Emp. Form.C7H10N2O8P2
Mol. Mass.312.1104
SMILESOP(O)(=O)C(Nc1cccc(c1)[N+]([O-])=O)P(O)(O)=O