Reaction Details
TargetCarbonic anhydrase 14
LigandBDBM50442512
Substrate/Competitorn/a
Meas. Tech.ChEMBL_1337728 (CHEMBL3240048)
IC50 7837±n/a nM
Citation Tauro, MLoiodice, FCeruso, MSupuran, CTTortorella, P Arylamino bisphosphonates: potent and selective inhibitors of the tumor-associated carbonic anhydrase XII. Bioorg Med Chem Lett24:1941-3 (2014) 
 
Carbonic anhydrase 14
Name:Carbonic anhydrase 14
Type:Enzyme
Mol. Mass.:37665.67
Organism:Homo sapiens (Human)
Description:Human (cloned) isozyme.
Residue:337
BDBM50442512
NameBDBM50442512
Synonyms:CHEMBL2440433
TypeSmall organic molecule
Emp. Form.C7H9Cl2NO6P2
Mol. Mass.336.003
SMILESOP(O)(=O)C(Nc1ccc(Cl)c(Cl)c1)P(O)(O)=O