Reaction Details
TargetCarbonic anhydrase 14
LigandBDBM50442510
Substrate/Competitorn/a
Meas. Tech.ChEMBL_1337728 (CHEMBL3240048)
IC50 5500±n/a nM
Citation Tauro, MLoiodice, FCeruso, MSupuran, CTTortorella, P Arylamino bisphosphonates: potent and selective inhibitors of the tumor-associated carbonic anhydrase XII. Bioorg Med Chem Lett24:1941-3 (2014) 
 
Carbonic anhydrase 14
Name:Carbonic anhydrase 14
Type:Enzyme
Mol. Mass.:37665.67
Organism:Homo sapiens (Human)
Description:Human (cloned) isozyme.
Residue:337
BDBM50442510
NameBDBM50442510
Synonyms:CHEMBL2440430
TypeSmall organic molecule
Emp. Form.C13H15NO7P2
Mol. Mass.359.2082
SMILESOP(O)(=O)C(Nc1ccc(Oc2ccccc2)cc1)P(O)(O)=O