Reaction Details
TargetGlucocorticoid receptor
LigandBDBM50001763
Substrate/Competitorn/a
Meas. Tech.ChEMBL_1338549 (CHEMBL3241426)
IC50 9.0±n/a nM
Citation Razavi, HRiether, DHarcken, CBentzien, JDinallo, RMSouza, DNelson, RMKukulka, AFadra-Khan, TNPack, EJZuvela-Jelaska, LPelletier, JPanzenbeck, MTorcellini, CAProudfoot, JRNabozny, GHThomson, DS Discovery of a potent and dissociated non-steroidal glucocorticoid receptor agonist containing an alkyl carbinol pharmacophore. Bioorg Med Chem Lett24:1934-40 (2014) 
 
Glucocorticoid receptor
Name:Glucocorticoid receptor
Type:Enzyme
Mol. Mass.:85656.87
Organism:Homo sapiens (Human)
Description:P04150
Residue:777
BDBM50001763
NameBDBM50001763
Synonyms:CHEMBL3233277
TypeSmall organic molecule
Emp. Form.C24H31FN2O2
Mol. Mass.398.5135
SMILESCOc1ccc(F)cc1C(C)(C)CC(O)(Cc1cc2cnccc2[nH]1)C(C)(C)C