Reaction Details
TargetProstaglandin G/H synthase 2
LigandBDBM50001936
Substrate/Competitorn/a
Meas. Tech.ChEMBL_1338952 (CHEMBL3240512)
IC50 6.0±n/a nM
Citation Kim, KJChoi, MJShin, JSKim, MChoi, HEKang, SMJin, JHLee, KTLee, JY Synthesis, biological evaluation, and docking analysis of a novel family of 1-methyl-1H-pyrrole-2,5-diones as highly potent and selective cyclooxygenase-2 (COX-2) inhibitors. Bioorg Med Chem Lett24:1958-62 (2014) 
 
Prostaglandin G/H synthase 2
Name:Prostaglandin G/H synthase 2
Type:Enzyme
Mol. Mass.:69003.89
Organism:Homo sapiens (Human)
Description:Recombinant Cox-2 provided by Cayman (Cayman Chemical Co.,Ann Arbor, MI).
Residue:604
BDBM50001936
NameBDBM50001936
Synonyms:CHEMBL3233602
TypeSmall organic molecule
Emp. Form.C17H13ClN2O4S
Mol. Mass.376.814
SMILESCN1C(=O)C(=C(C1=O)c1ccc(cc1)S(N)(=O)=O)c1ccc(Cl)cc1