Reaction Details
TargetD(2) dopamine receptor
LigandBDBM50003071
Substrate/Competitorn/a
Meas. Tech.ChEMBL_1335160 (CHEMBL3239709)
Ki 240±n/a nM
Citation Xiao, JFree, RBBarnaeva, EConroy, JLDoyle, TMiller, BBryant-Genevier, MTaylor, MKHu, XDulcey, AESouthall, NFerrer, MTitus, SZheng, WSibley, DRMarugan, JJ Discovery, optimization, and characterization of novel D2 dopamine receptor selective antagonists. J Med Chem57:3450-63 (2014) 
 
D(2) dopamine receptor
Name:D(2) dopamine receptor
Type:Cell-surface receptors
Mol. Mass.:50647.10
Organism:Homo sapiens (Human)
Description:P14416
Residue:443
BDBM50003071
NameBDBM50003071
Synonyms:CHEMBL3234541
TypeSmall organic molecule
Emp. Form.C22H17BrN2O3S
Mol. Mass.469.351
SMILESCN1c2cc(ccc2[S@@+]([O-])c2ccccc2C1=O)C(=O)NCc1ccc(Br)cc1