Reaction Details
TargetD(3) dopamine receptor
LigandBDBM50003075
Substrate/Competitorn/a
Meas. Tech.ChEMBL_1335161 (CHEMBL3239710)
Ki>50000±n/a nM
Citation Xiao, JFree, RBBarnaeva, EConroy, JLDoyle, TMiller, BBryant-Genevier, MTaylor, MKHu, XDulcey, AESouthall, NFerrer, MTitus, SZheng, WSibley, DRMarugan, JJ Discovery, optimization, and characterization of novel D2 dopamine receptor selective antagonists. J Med Chem57:3450-63 (2014) 
 
D(3) dopamine receptor
Name:D(3) dopamine receptor
Type:n/a
Mol. Mass.:44243.43
Organism:Homo sapiens (Human)
Description:n/a
Residue:400
BDBM50003075
NameBDBM50003075
Synonyms:CHEMBL3234545
TypeSmall organic molecule
Emp. Form.C21H18N2O3S2
Mol. Mass.410.509
SMILESCN1c2cc(ccc2[S@+]([O-])c2ccccc2C1=O)C(=O)NCCc1cccs1