Reaction Details
TargetCytochrome P450 3A4
LigandBDBM50003477
Substrate/Competitorn/a
Meas. Tech.ChEMBL_1335568 (CHEMBL3239423)
IC50<100±n/a nM
Citation Phillips, DPGao, WYang, YZhang, GLerario, IKLau, TLJiang, JWang, XNguyen, DGBhat, BGTrotter, CSullivan, HWelzel, GLandry, JChen, YJoseph, SBLi, CGordon, WPRichmond, WJohnson, KBretz, ABursulaya, BPan, SMcNamara, PSeidel, HM Discovery of trifluoromethyl(pyrimidin-2-yl)azetidine-2-carboxamides as potent, orally bioavailable TGR5 (GPBAR1) agonists: structure-activity relationships, lead optimization, and chronic in vivo efficacy. J Med Chem57:3263-82 (2014) 
 
Cytochrome P450 3A4
Name:Cytochrome P450 3A4
Type:Enzyme
Mol. Mass.:57349.57
Organism:Homo sapiens (Human)
Description:n/a
Residue:503
BDBM50003477
NameBDBM50003477
Synonyms:CHEMBL3234569
TypeSmall organic molecule
Emp. Form.C24H28F3N7O
Mol. Mass.487.5206
SMILESFC(F)(F)c1nc(cc(n1)N1CCC[C@H](C1)C(=O)NCCc1ccc(cc1)C#N)N1CCNCC1