Reaction Details
TargetCytochrome P450 3A4
LigandBDBM50003076
Substrate/Competitorn/a
Meas. Tech.ChEMBL_1335568 (CHEMBL3239423)
IC50 400±n/a nM
Citation Phillips, DPGao, WYang, YZhang, GLerario, IKLau, TLJiang, JWang, XNguyen, DGBhat, BGTrotter, CSullivan, HWelzel, GLandry, JChen, YJoseph, SBLi, CGordon, WPRichmond, WJohnson, KBretz, ABursulaya, BPan, SMcNamara, PSeidel, HM Discovery of trifluoromethyl(pyrimidin-2-yl)azetidine-2-carboxamides as potent, orally bioavailable TGR5 (GPBAR1) agonists: structure-activity relationships, lead optimization, and chronic in vivo efficacy. J Med Chem57:3263-82 (2014) 
 
Cytochrome P450 3A4
Name:Cytochrome P450 3A4
Type:Enzyme
Mol. Mass.:57349.57
Organism:Homo sapiens (Human)
Description:n/a
Residue:503
BDBM50003076
NameBDBM50003076
Synonyms:CHEMBL3234574
TypeSmall organic molecule
Emp. Form.C25H30F3N7O
Mol. Mass.501.5472
SMILESCN1CCN(CC1)c1cc(nc(n1)C(F)(F)F)N1CCCC[C@H]1C(=O)NCCc1ccc(cc1)C#N