Reaction Details
TargetTranscriptional regulator ERG
LigandBDBM50003559
Substrate/Competitorn/a
Meas. Tech.ChEMBL_1335569 (CHEMBL3239424)
IC50>30000±n/a nM
Citation Phillips, DPGao, WYang, YZhang, GLerario, IKLau, TLJiang, JWang, XNguyen, DGBhat, BGTrotter, CSullivan, HWelzel, GLandry, JChen, YJoseph, SBLi, CGordon, WPRichmond, WJohnson, KBretz, ABursulaya, BPan, SMcNamara, PSeidel, HM Discovery of trifluoromethyl(pyrimidin-2-yl)azetidine-2-carboxamides as potent, orally bioavailable TGR5 (GPBAR1) agonists: structure-activity relationships, lead optimization, and chronic in vivo efficacy. J Med Chem57:3263-82 (2014) 
 
Transcriptional regulator ERG
Name:Transcriptional regulator ERG
Type:PROTEIN
Mol. Mass.:54615.84
Organism:Homo sapiens (Human)
Description:ChEMBL_1335569
Residue:486
BDBM50003559
NameBDBM50003559
Synonyms:CHEMBL3234570
TypeSmall organic molecule
Emp. Form.C27H32F3N7O2
Mol. Mass.543.5839
SMILESFC(F)(F)c1nc(cc(n1)N1CCC[C@H](C1)C(=O)NCCc1ccc(cc1)C#N)N1CCN(CC1)C1COC1