Reaction Details
TargetTranscriptional regulator ERG
LigandBDBM50003563
Substrate/Competitorn/a
Meas. Tech.ChEMBL_1335569 (CHEMBL3239424)
IC50 18000±n/a nM
Citation Phillips, DPGao, WYang, YZhang, GLerario, IKLau, TLJiang, JWang, XNguyen, DGBhat, BGTrotter, CSullivan, HWelzel, GLandry, JChen, YJoseph, SBLi, CGordon, WPRichmond, WJohnson, KBretz, ABursulaya, BPan, SMcNamara, PSeidel, HM Discovery of trifluoromethyl(pyrimidin-2-yl)azetidine-2-carboxamides as potent, orally bioavailable TGR5 (GPBAR1) agonists: structure-activity relationships, lead optimization, and chronic in vivo efficacy. J Med Chem57:3263-82 (2014) 
 
Transcriptional regulator ERG
Name:Transcriptional regulator ERG
Type:PROTEIN
Mol. Mass.:54615.84
Organism:Homo sapiens (Human)
Description:ChEMBL_1335569
Residue:486
BDBM50003563
NameBDBM50003563
Synonyms:CHEMBL3234573
TypeSmall organic molecule
Emp. Form.C24H30F3N9O
Mol. Mass.517.5499
SMILESCCN1CCN(CC1)c1cc(nc(n1)C(F)(F)F)N1CCC[C@H](C1)C(=O)NCCc1cnc(nc1)C#N