Reaction Details
TargetAdenosine receptor A1
LigandBDBM50003699
Substrate/Competitorn/a
Meas. Tech.ChEMBL_1336085 (CHEMBL3240796)
Ki 1.8±n/a nM
Citation Louvel, JGuo, DAgliardi, MMocking, TAKars, RPham, TPXia, Lde Vries, HBrussee, JHeitman, LHIjzerman, AP Agonists for the adenosine A1 receptor with tunable residence time. A Case for nonribose 4-amino-6-aryl-5-cyano-2-thiopyrimidines. J Med Chem57:3213-22 (2014) 
 
Adenosine receptor A1
Name:Adenosine receptor A1
Type:G Protein-Coupled Receptor (GPCR)
Mol. Mass.:36520.92
Organism:Homo sapiens (Human)
Description:P30542
Residue:326
BDBM50003699
NameBDBM50003699
Synonyms:CHEMBL3234952
TypeSmall organic molecule
Emp. Form.C23H17N5O3S2
Mol. Mass.475.543
SMILESCOc1ccc(cc1)-c1nc(CSc2nc(N)c(C#N)c(n2)-c2ccc3OCOc3c2)cs1