Reaction Details
TargetAdenosine receptor A1
LigandBDBM50003702
Substrate/Competitorn/a
Meas. Tech.ChEMBL_1336085 (CHEMBL3240796)
Ki 9.9±n/a nM
Citation Louvel, JGuo, DAgliardi, MMocking, TAKars, RPham, TPXia, Lde Vries, HBrussee, JHeitman, LHIjzerman, AP Agonists for the adenosine A1 receptor with tunable residence time. A Case for nonribose 4-amino-6-aryl-5-cyano-2-thiopyrimidines. J Med Chem57:3213-22 (2014) 
 
Adenosine receptor A1
Name:Adenosine receptor A1
Type:G Protein-Coupled Receptor (GPCR)
Mol. Mass.:36520.92
Organism:Homo sapiens (Human)
Description:P30542
Residue:326
BDBM50003702
NameBDBM50003702
Synonyms:CHEMBL3234955
TypeSmall organic molecule
Emp. Form.C22H14IN5O2S2
Mol. Mass.571.413
SMILESNc1nc(SCc2csc(n2)-c2ccc(I)cc2)nc(-c2ccc3OCOc3c2)c1C#N