Reaction Details
TargetHeat shock protein 75 kDa, mitochondrial
LigandBDBM50003865
Substrate/Competitorn/a
Meas. Tech.ChEMBL_1336951 (CHEMBL3242259)
Ki>10000±n/a nM
Citation Ernst, JTNeubert, TLiu, MSperry, SZuccola, HTurnbull, AFleck, BKargo, WWoody, LChiang, PTran, DChen, WSnyder, PAlcacio, TNezami, AReynolds, JAlvi, KGoulet, LStamos, D Identification of novel HSP90a/ß isoform selective inhibitors using structure-based drug design. demonstration of potential utility in treating CNS disorders such as Huntington's disease. J Med Chem57:3382-400 (2014) 
 
Heat shock protein 75 kDa, mitochondrial
Name:Heat shock protein 75 kDa, mitochondrial
Type:PROTEIN
Mol. Mass.:80120.13
Organism:Homo sapiens (Human)
Description:ChEMBL_1478164
Residue:704
BDBM50003865
NameBDBM50003865
Synonyms:CHEMBL3235352
TypeSmall organic molecule
Emp. Form.C24H30N2O2
Mol. Mass.378.5072
SMILESCC(C)Cc1cc(cc2CCNC(=O)c12)-n1cc(C)c2c1CC(C)(C)CC2=O