Reaction Details
TargetHeat shock protein HSP 90-beta
LigandBDBM50003877
Substrate/Competitorn/a
Meas. Tech.ChEMBL_1336952 (CHEMBL3242260)
IC50 80±n/a nM
Citation Ernst, JTNeubert, TLiu, MSperry, SZuccola, HTurnbull, AFleck, BKargo, WWoody, LChiang, PTran, DChen, WSnyder, PAlcacio, TNezami, AReynolds, JAlvi, KGoulet, LStamos, D Identification of novel HSP90a/ß isoform selective inhibitors using structure-based drug design. demonstration of potential utility in treating CNS disorders such as Huntington's disease. J Med Chem57:3382-400 (2014) 
 
Heat shock protein HSP 90-beta
Name:Heat shock protein HSP 90-beta
Type:Molecular Chaperone
Mol. Mass.:83229.45
Organism:Homo sapiens (Human)
Description:P08238
Residue:724
BDBM50003877
NameBDBM50003877
Synonyms:CHEMBL3235361
TypeSmall organic molecule
Emp. Form.C26H25FN2O2
Mol. Mass.416.4873
SMILESCc1cn(c2CC(C)(C)CC(=O)c12)-c1cc2CCNC(=O)c2c(c1)-c1ccc(F)cc1