Reaction Details
TargetEndoplasmin
LigandBDBM50003881
Substrate/Competitorn/a
Meas. Tech.ChEMBL_1336950 (CHEMBL3242258)
Ki 4400±n/a nM
Citation Ernst, JTNeubert, TLiu, MSperry, SZuccola, HTurnbull, AFleck, BKargo, WWoody, LChiang, PTran, DChen, WSnyder, PAlcacio, TNezami, AReynolds, JAlvi, KGoulet, LStamos, D Identification of novel HSP90a/ß isoform selective inhibitors using structure-based drug design. demonstration of potential utility in treating CNS disorders such as Huntington's disease. J Med Chem57:3382-400 (2014) 
 
Endoplasmin
Name:Endoplasmin
Type:Protein
Mol. Mass.:92417.36
Organism:Homo sapiens (Human)
Description:P14625
Residue:803
BDBM50003881
NameBDBM50003881
Synonyms:CHEMBL3235333
TypeSmall organic molecule
Emp. Form.C25H31FN4O3
Mol. Mass.454.537
SMILESCN1CCc2c(C1)n(c1CC(C)(C)CC(=O)c21)-c1cc(F)c(C(N)=O)c(N[C@H]2CCOC2)c1