Reaction Details
TargetEndoplasmin
LigandBDBM50003869
Substrate/Competitorn/a
Meas. Tech.ChEMBL_1336950 (CHEMBL3242258)
Ki>10000±n/a nM
Citation Ernst, JTNeubert, TLiu, MSperry, SZuccola, HTurnbull, AFleck, BKargo, WWoody, LChiang, PTran, DChen, WSnyder, PAlcacio, TNezami, AReynolds, JAlvi, KGoulet, LStamos, D Identification of novel HSP90a/ß isoform selective inhibitors using structure-based drug design. demonstration of potential utility in treating CNS disorders such as Huntington's disease. J Med Chem57:3382-400 (2014) 
 
Endoplasmin
Name:Endoplasmin
Type:Protein
Mol. Mass.:92417.36
Organism:Homo sapiens (Human)
Description:P14625
Residue:803
BDBM50003869
NameBDBM50003869
Synonyms:CHEMBL3235354
TypeSmall organic molecule
Emp. Form.C26H32N2O2
Mol. Mass.404.5445
SMILESCc1cn(c2CC(C)(C)CC(=O)c12)-c1cc2CCNC(=O)c2c(c1)C1CCCCC1