Reaction Details
TargetHeat shock protein HSP 90-alpha
LigandBDBM50003878
Substrate/Competitorn/a
Meas. Tech.ChEMBL_1336948 (CHEMBL3242256)
Ki 20±n/a nM
Citation Ernst, JTNeubert, TLiu, MSperry, SZuccola, HTurnbull, AFleck, BKargo, WWoody, LChiang, PTran, DChen, WSnyder, PAlcacio, TNezami, AReynolds, JAlvi, KGoulet, LStamos, D Identification of novel HSP90a/ß isoform selective inhibitors using structure-based drug design. demonstration of potential utility in treating CNS disorders such as Huntington's disease. J Med Chem57:3382-400 (2014) 
 
Heat shock protein HSP 90-alpha
Name:Heat shock protein HSP 90-alpha
Type:Molecular Chaperone
Mol. Mass.:84623.45
Organism:Homo sapiens (Human)
Description:P07900
Residue:732
BDBM50003878
NameBDBM50003878
Synonyms:CHEMBL3235362
TypeSmall organic molecule
Emp. Form.C26H25FN2O2
Mol. Mass.416.4873
SMILESCc1cn(c2CC(C)(C)CC(=O)c12)-c1cc2CCNC(=O)c2c(c1)-c1cccc(F)c1