Reaction Details
TargetHeat shock protein HSP 90-alpha
LigandBDBM50003880
Substrate/Competitorn/a
Meas. Tech.ChEMBL_1336948 (CHEMBL3242256)
Ki 40±n/a nM
Citation Ernst, JTNeubert, TLiu, MSperry, SZuccola, HTurnbull, AFleck, BKargo, WWoody, LChiang, PTran, DChen, WSnyder, PAlcacio, TNezami, AReynolds, JAlvi, KGoulet, LStamos, D Identification of novel HSP90a/ß isoform selective inhibitors using structure-based drug design. demonstration of potential utility in treating CNS disorders such as Huntington's disease. J Med Chem57:3382-400 (2014) 
 
Heat shock protein HSP 90-alpha
Name:Heat shock protein HSP 90-alpha
Type:Molecular Chaperone
Mol. Mass.:84623.45
Organism:Homo sapiens (Human)
Description:P07900
Residue:732
BDBM50003880
NameBDBM50003880
Synonyms:CHEMBL3235363
TypeSmall organic molecule
Emp. Form.C27H28N2O3
Mol. Mass.428.5228
SMILESCOc1ccc(cc1)-c1cc(cc2CCNC(=O)c12)-n1cc(C)c2c1CC(C)(C)CC2=O