Reaction Details
Target5-hydroxytryptamine receptor 1A
LigandBDBM50003915
Substrate/Competitorn/a
Meas. Tech.ChEMBL_1337341 (CHEMBL3241203)
Ki<1.000000±n/a nM
Citation Canale, VGuzik, PKurczab, RVerdie, PSatala, GKubica, BPawlowski, MMartinez, JSubra, GBojarski, AJZajdel, P Solid-supported synthesis, molecular modeling, and biological activity of long-chain arylpiperazine derivatives with cyclic amino acid amide fragments as 5-HT(7) and 5-HT(1A) receptor ligands. Eur J Med Chem78:10-22 (2014) 
 
5-hydroxytryptamine receptor 1A
Name:5-hydroxytryptamine receptor 1A
Type:n/a
Mol. Mass.:46122.49
Organism:Homo sapiens (Human)
Description:n/a
Residue:422
BDBM50003915
NameBDBM50003915
Synonyms:CHEMBL3235744
TypeSmall organic molecule
Emp. Form.C27H36N4O2S
Mol. Mass.480.665
SMILESCSc1ccccc1N1CCN(CCCCCC(=O)N2Cc3ccccc3C[C@H]2C(N)=O)CC1