Reaction Details
TargetMu-type opioid receptor
LigandBDBM50004177
Substrate/Competitorn/a
Meas. Tech.ChEMBL_1339023 (CHEMBL3243889)
Ki>375±n/a nM
Citation Toledo, MAPedregal, CLafuente, CDiaz, NMartinez-Grau, MAJiménez, ABenito, ATorrado, AMateos, CJoshi, EMKahl, SDRash, KSMudra, DRBarth, VNShaw, DBMcKinzie, DWitkin, JMStatnick, MA Discovery of a novel series of orally active nociceptin/orphanin FQ (NOP) receptor antagonists based on a dihydrospiro(piperidine-4,7'-thieno[2,3-c]pyran) scaffold. J Med Chem57:3418-29 (2014) 
 
Mu-type opioid receptor
Name:Mu-type opioid receptor
Type:G Protein-Coupled Receptor (GPCR)
Mol. Mass.:44789.51
Organism:Homo sapiens (Human)
Description:P35372
Residue:400
BDBM50004177
NameBDBM50004177
Synonyms:CHEMBL3236488
TypeSmall organic molecule
Emp. Form.C27H31ClF2N4O8S
Mol. Mass.645.072
SMILESOC(C(O)C(O)=O)C(O)=O.COCc1cccnc1-n1cc(CN2CCC3(CC2)OCC(F)(F)c2cc(Cl)sc32)c(C)n1