Reaction Details
TargetKappa-type opioid receptor
LigandBDBM50004174
Substrate/Competitorn/a
Meas. Tech.ChEMBL_1339024 (CHEMBL3243890)
Ki>375±n/a nM
Citation Toledo, MAPedregal, CLafuente, CDiaz, NMartinez-Grau, MAJiménez, ABenito, ATorrado, AMateos, CJoshi, EMKahl, SDRash, KSMudra, DRBarth, VNShaw, DBMcKinzie, DWitkin, JMStatnick, MA Discovery of a novel series of orally active nociceptin/orphanin FQ (NOP) receptor antagonists based on a dihydrospiro(piperidine-4,7'-thieno[2,3-c]pyran) scaffold. J Med Chem57:3418-29 (2014) 
 
Kappa-type opioid receptor
Name:Kappa-type opioid receptor
Type:G Protein-Coupled Receptor (GPCR)
Mol. Mass.:42648.76
Organism:Homo sapiens (Human)
Description:P41145
Residue:380
BDBM50004174
NameBDBM50004174
Synonyms:CHEMBL3236485
TypeSmall organic molecule
Emp. Form.C28H32ClF3N4O7S
Mol. Mass.661.089
SMILESOC(C(O)C(O)=O)C(O)=O.CNCc1cccc(F)c1-n1cc(CN2CCC3(CC2)OCC(F)(F)c2cc(Cl)sc32)c(C)n1