Reaction Details
TargetAurora kinase B
LigandBDBM50004205
Substrate/Competitorn/a
Meas. Tech.ChEMBL_1339457 (CHEMBL3243850)
Ki 18±n/a nM
Citation Luo, YDeng, YQWang, JLong, ZJTu, ZCPeng, WZhang, JQLiu, QLu, G Design, synthesis and bioevaluation of N-trisubstituted pyrimidine derivatives as potent aurora A kinase inhibitors. Eur J Med Chem78:65-71 (2014) 
 
Aurora kinase B
Name:Aurora kinase B
Type:Protein
Mol. Mass.:39327.72
Organism:Homo sapiens (Human)
Description:Q96GD4
Residue:344
BDBM50004205
NameBDBM50004205
Synonyms:MK-045 TOZASERTIB VX-68 | VX-680
TypeSmall organic molecule
Emp. Form.C23H28N8OS
Mol. Mass.464.586
SMILESCN1CCN(CC1)c1cc(Nc2cc(C)[nH]n2)nc(Sc2ccc(NC(=O)C3CC3)cc2)n1