Reaction Details
TargetCarbonic anhydrase 2
LigandBDBM50004255
Substrate/Competitorn/a
Meas. Tech.ChEMBL_1335178 (CHEMBL3239762)
IC50 490±n/a nM
Citation Zaib, SSaeed, AStolte, KFlörke, UShahid, MIqbal, J New aminobenzenesulfonamide-thiourea conjugates: synthesis and carbonic anhydrase inhibition and docking studies. Eur J Med Chem78:140-50 (2014) 
 
Carbonic anhydrase 2
Name:Carbonic anhydrase 2
Type:Enzyme Catalytic Domain
Mol. Mass.:29115.93
Organism:Bos taurus
Description:n/a
Residue:260
BDBM50004255
NameBDBM50004255
Synonyms:CHEMBL1330833
TypeSmall organic molecule
Emp. Form.C14H12N4O5S2
Mol. Mass.380.399
SMILESNS(=O)(=O)c1cccc(NC(=S)NC(=O)c2cccc(c2)[N+]([O-])=O)c1