Reaction Details
TargetCarbonic anhydrase 2
LigandBDBM50004260
Substrate/Competitorn/a
Meas. Tech.ChEMBL_1335178 (CHEMBL3239762)
IC50 1280±n/a nM
Citation Zaib, SSaeed, AStolte, KFlörke, UShahid, MIqbal, J New aminobenzenesulfonamide-thiourea conjugates: synthesis and carbonic anhydrase inhibition and docking studies. Eur J Med Chem78:140-50 (2014) 
 
Carbonic anhydrase 2
Name:Carbonic anhydrase 2
Type:Enzyme Catalytic Domain
Mol. Mass.:29115.93
Organism:Bos taurus
Description:n/a
Residue:260
BDBM50004260
NameBDBM50004260
Synonyms:CHEMBL3237499
TypeSmall organic molecule
Emp. Form.C12H17N3O3S2
Mol. Mass.315.412
SMILESCC(C)(C)C(=O)NC(=S)Nc1cccc(c1)S(N)(=O)=O