Reaction Details
TargetIntegrase
LigandBDBM25351
Substrate/Competitorn/a
Meas. Tech.ChEMBL_1336115 (CHEMBL3240943)
IC50 12800±n/a nM
Citation Costi, RMétifiot, MChung, SCuzzucoli Crucitti, GMaddali, KPescatori, LMessore, AMadia, VNPupo, GScipione, LTortorella, SDi Leva, FSCosconati, SMarinelli, LNovellino, ELe Grice, SFCorona, APommier, YMarchand, CDi Santo, R Basic quinolinonyl diketo acid derivatives as inhibitors of HIV integrase and their activity against RNase H function of reverse transcriptase. J Med Chem57:3223-34 (2014) 
 
Integrase
Name:Integrase
Synonyms:Human immunodeficiency virus type 1 integrase
Type:PROTEIN
Mol. Mass.:32231.48
Organism:Human immunodeficiency virus 1
Description:ChEMBL_90865
Residue:288
BDBM25351
NameBDBM25351
TypeSmall organic molecule
Emp. Form.C20H21FN6O5
Mol. Mass.444.4163
SMILESCc1nnc(o1)C(=O)NC(C)(C)c1nc(C(=O)NCc2ccc(F)cc2)c(O)c(=O)n1C