Reaction Details
TargetRho-associated protein kinase 1
LigandBDBM50004422
Substrate/Competitorn/a
Meas. Tech.ChEMBL_1336572 (CHEMBL3240143)
IC50 105±n/a nM
Citation Chen, HHNamil, ASeverns, BWard, JKelly, CDrace, CMcLaughlin, MAYacoub, SLi, BPatil, RSharif, NHellberg, MRRusinko, APang, IHCombrink, KD In vivo optimization of 2,3-diaminopyrazine Rho Kinase inhibitors for the treatment of glaucoma. Bioorg Med Chem Lett24:1875-9 (2014) 
 
Rho-associated protein kinase 1
Name:Rho-associated protein kinase 1
Type:Serine/threonine-protein kinase
Mol. Mass.:158156.77
Organism:Homo sapiens (Human)
Description:Q13464
Residue:1354
BDBM50004422
NameBDBM50004422
Synonyms:CHEMBL3238167
TypeSmall organic molecule
Emp. Form.C16H18N6
Mol. Mass.294.3543
SMILESC1CNCCN(C1)c1cncc(n1)-c1ccc2[nH]ncc2c1