Reaction Details
TargetRho-associated protein kinase 2
LigandBDBM50004420
Substrate/Competitorn/a
Meas. Tech.ChEMBL_1336571 (CHEMBL3240142)
IC50 75±n/a nM
Citation Chen, HHNamil, ASeverns, BWard, JKelly, CDrace, CMcLaughlin, MAYacoub, SLi, BPatil, RSharif, NHellberg, MRRusinko, APang, IHCombrink, KD In vivo optimization of 2,3-diaminopyrazine Rho Kinase inhibitors for the treatment of glaucoma. Bioorg Med Chem Lett24:1875-9 (2014) 
 
Rho-associated protein kinase 2
Name:Rho-associated protein kinase 2
Type:Protein
Mol. Mass.:160885.43
Organism:Homo sapiens (Human)
Description:O75116
Residue:1388
BDBM50004420
NameBDBM50004420
Synonyms:CHEMBL3238165
TypeSmall organic molecule
Emp. Form.C22H31N7O
Mol. Mass.409.5278
SMILESCC(=O)NCCCN1CCN(CC1)c1nc(cnc1N1CCCC1)-c1ccncc1