Reaction Details
TargetRho-associated protein kinase 2
LigandBDBM50004422
Substrate/Competitorn/a
Meas. Tech.ChEMBL_1336571 (CHEMBL3240142)
IC50 24±n/a nM
Citation Chen, HHNamil, ASeverns, BWard, JKelly, CDrace, CMcLaughlin, MAYacoub, SLi, BPatil, RSharif, NHellberg, MRRusinko, APang, IHCombrink, KD In vivo optimization of 2,3-diaminopyrazine Rho Kinase inhibitors for the treatment of glaucoma. Bioorg Med Chem Lett24:1875-9 (2014) 
 
Rho-associated protein kinase 2
Name:Rho-associated protein kinase 2
Type:Protein
Mol. Mass.:160885.43
Organism:Homo sapiens (Human)
Description:O75116
Residue:1388
BDBM50004422
NameBDBM50004422
Synonyms:CHEMBL3238167
TypeSmall organic molecule
Emp. Form.C16H18N6
Mol. Mass.294.3543
SMILESC1CNCCN(C1)c1cncc(n1)-c1ccc2[nH]ncc2c1