Reaction Details
TargetRho-associated protein kinase 2
LigandBDBM50309126
Substrate/Competitorn/a
Meas. Tech.ChEMBL_1336573 (CHEMBL3240144)
EC50 680±n/a nM
Citation Chen, HHNamil, ASeverns, BWard, JKelly, CDrace, CMcLaughlin, MAYacoub, SLi, BPatil, RSharif, NHellberg, MRRusinko, APang, IHCombrink, KD In vivo optimization of 2,3-diaminopyrazine Rho Kinase inhibitors for the treatment of glaucoma. Bioorg Med Chem Lett24:1875-9 (2014) 
 
Rho-associated protein kinase 2
Name:Rho-associated protein kinase 2
Type:Protein
Mol. Mass.:160885.43
Organism:Homo sapiens (Human)
Description:O75116
Residue:1388
BDBM50309126
NameBDBM50309126
Synonyms:2-(4-(6-(pyridin-4-yl)-3-(pyrrolidin-1-yl)pyrazin-2-yl)piperazin-1-yl)ethanol | CHEMBL599163
TypeSmall organic molecule
Emp. Form.C19H26N6O
Mol. Mass.354.4493
SMILESOCCN1CCN(CC1)c1nc(cnc1N1CCCC1)-c1ccncc1