Reaction Details
TargetRho-associated protein kinase 2
LigandBDBM50004419
Substrate/Competitorn/a
Meas. Tech.ChEMBL_1336573 (CHEMBL3240144)
EC50 1700±n/a nM
Citation Chen, HHNamil, ASeverns, BWard, JKelly, CDrace, CMcLaughlin, MAYacoub, SLi, BPatil, RSharif, NHellberg, MRRusinko, APang, IHCombrink, KD In vivo optimization of 2,3-diaminopyrazine Rho Kinase inhibitors for the treatment of glaucoma. Bioorg Med Chem Lett24:1875-9 (2014) 
 
Rho-associated protein kinase 2
Name:Rho-associated protein kinase 2
Type:Protein
Mol. Mass.:160885.43
Organism:Homo sapiens (Human)
Description:O75116
Residue:1388
BDBM50004419
NameBDBM50004419
Synonyms:CHEMBL3238164
TypeSmall organic molecule
Emp. Form.C22H31N7O2
Mol. Mass.425.5272
SMILESCC(=O)NCC(O)CN1CCN(CC1)c1nc(cnc1N1CCCC1)-c1ccncc1