Reaction Details
TargetCarbonic anhydrase 1
LigandBDBM50004507
Substrate/Competitorn/a
Meas. Tech.ChEMBL_1337402 (CHEMBL3241547)
Ki 4930±n/a nM
Citation Moeker, JPeat, TSBornaghi, LFVullo, DSupuran, CTPoulsen, SA Cyclic secondary sulfonamides: unusually good inhibitors of cancer-related carbonic anhydrase enzymes. J Med Chem57:3522-31 (2014) 
 
Carbonic anhydrase 1
Name:Carbonic anhydrase 1
Type:Enzyme
Mol. Mass.:28873.37
Organism:Homo sapiens (Human)
Description:P00915
Residue:261
BDBM50004507
NameBDBM50004507
Synonyms:CHEMBL3233387
TypeSmall organic molecule
Emp. Form.C7H4N4O3S
Mol. Mass.224.197
SMILES[N-]=[N+]=Nc1ccc2C(=O)NS(=O)(=O)c2c1