Reaction Details
TargetCarbonic anhydrase 2
LigandBDBM50004484
Substrate/Competitorn/a
Meas. Tech.ChEMBL_1337403 (CHEMBL3241548)
Ki>50000±n/a nM
Citation Moeker, JPeat, TSBornaghi, LFVullo, DSupuran, CTPoulsen, SA Cyclic secondary sulfonamides: unusually good inhibitors of cancer-related carbonic anhydrase enzymes. J Med Chem57:3522-31 (2014) 
 
Carbonic anhydrase 2
Name:Carbonic anhydrase 2
Type:Enzyme
Mol. Mass.:29250.71
Organism:Homo sapiens (Human)
Description:P00918
Residue:260
BDBM50004484
NameBDBM50004484
Synonyms:CHEMBL3233386
TypeSmall organic molecule
Emp. Form.C7H4N2O5S
Mol. Mass.228.182
SMILES[O-][N+](=O)c1ccc2C(=O)NS(=O)(=O)c2c1