Reaction Details
TargetCarbonic anhydrase 2
LigandBDBM50004508
Substrate/Competitorn/a
Meas. Tech.ChEMBL_1337403 (CHEMBL3241548)
Ki 9315±n/a nM
Citation Moeker, JPeat, TSBornaghi, LFVullo, DSupuran, CTPoulsen, SA Cyclic secondary sulfonamides: unusually good inhibitors of cancer-related carbonic anhydrase enzymes. J Med Chem57:3522-31 (2014) 
 
Carbonic anhydrase 2
Name:Carbonic anhydrase 2
Type:Enzyme
Mol. Mass.:29250.71
Organism:Homo sapiens (Human)
Description:P00918
Residue:260
BDBM50004508
NameBDBM50004508
Synonyms:CHEMBL3233388
TypeSmall organic molecule
Emp. Form.C15H10N4O3S
Mol. Mass.326.33
SMILESO=C1NS(=O)(=O)c2cc(ccc12)-n1cc(nn1)-c1ccccc1