Reaction Details
TargetCarbonic anhydrase 2
LigandBDBM50004512
Substrate/Competitorn/a
Meas. Tech.ChEMBL_1337403 (CHEMBL3241548)
Ki 4870±n/a nM
Citation Moeker, JPeat, TSBornaghi, LFVullo, DSupuran, CTPoulsen, SA Cyclic secondary sulfonamides: unusually good inhibitors of cancer-related carbonic anhydrase enzymes. J Med Chem57:3522-31 (2014) 
 
Carbonic anhydrase 2
Name:Carbonic anhydrase 2
Type:Enzyme
Mol. Mass.:29250.71
Organism:Homo sapiens (Human)
Description:P00918
Residue:260
BDBM50004512
NameBDBM50004512
Synonyms:CHEMBL3233392
TypeSmall organic molecule
Emp. Form.C16H11FN4O3S
Mol. Mass.358.347
SMILESCc1cc(ccc1F)-c1cn(nn1)-c1ccc2C(=O)NS(=O)(=O)c2c1