Reaction Details
TargetCarbonic anhydrase 6
LigandBDBM29278
Substrate/Competitorn/a
Meas. Tech.ChEMBL_1337407 (CHEMBL3241552)
Ki 935±n/a nM
Citation Moeker, JPeat, TSBornaghi, LFVullo, DSupuran, CTPoulsen, SA Cyclic secondary sulfonamides: unusually good inhibitors of cancer-related carbonic anhydrase enzymes. J Med Chem57:3522-31 (2014) 
 
Carbonic anhydrase 6
Name:Carbonic anhydrase 6
Type:Enzyme
Mol. Mass.:35371.40
Organism:Homo sapiens (Human)
Description:P23280
Residue:308
BDBM29278
NameBDBM29278
Synonyms:CHEMBL310671 SAC Saccharin
TypeSmall organic molecule
Emp. Form.C7H5NO3S
Mol. Mass.183.185
SMILESO=C1NS(=O)(=O)c2ccccc12