Reaction Details
TargetCarbonic anhydrase 7
LigandBDBM29278
Substrate/Competitorn/a
Meas. Tech.ChEMBL_1337408 (CHEMBL3241553)
Ki 10.0±n/a nM
Citation Moeker, JPeat, TSBornaghi, LFVullo, DSupuran, CTPoulsen, SA Cyclic secondary sulfonamides: unusually good inhibitors of cancer-related carbonic anhydrase enzymes. J Med Chem57:3522-31 (2014) 
 
Carbonic anhydrase 7
Name:Carbonic anhydrase 7
Type:Enzyme
Mol. Mass.:29664.11
Organism:Homo sapiens (Human)
Description:Human cloned isozyme.
Residue:264
BDBM29278
NameBDBM29278
Synonyms:CHEMBL310671 SAC Saccharin
TypeSmall organic molecule
Emp. Form.C7H5NO3S
Mol. Mass.183.185
SMILESO=C1NS(=O)(=O)c2ccccc12