Reaction Details
TargetCarbonic anhydrase 9
LigandBDBM50004507
Substrate/Competitorn/a
Meas. Tech.ChEMBL_1337409 (CHEMBL3241554)
Ki 466±n/a nM
Citation Moeker, JPeat, TSBornaghi, LFVullo, DSupuran, CTPoulsen, SA Cyclic secondary sulfonamides: unusually good inhibitors of cancer-related carbonic anhydrase enzymes. J Med Chem57:3522-31 (2014) 
 
Carbonic anhydrase 9
Name:Carbonic anhydrase 9
Type:Enzyme
Mol. Mass.:49669.03
Organism:Homo sapiens (Human)
Description:Catalytic domain of human cloned isozyme was used in the assay
Residue:459
BDBM50004507
NameBDBM50004507
Synonyms:CHEMBL3233387
TypeSmall organic molecule
Emp. Form.C7H4N4O3S
Mol. Mass.224.197
SMILES[N-]=[N+]=Nc1ccc2C(=O)NS(=O)(=O)c2c1