Reaction Details
TargetCarbonic anhydrase 9
LigandBDBM50004515
Substrate/Competitorn/a
Meas. Tech.ChEMBL_1337409 (CHEMBL3241554)
Ki 50±n/a nM
Citation Moeker, JPeat, TSBornaghi, LFVullo, DSupuran, CTPoulsen, SA Cyclic secondary sulfonamides: unusually good inhibitors of cancer-related carbonic anhydrase enzymes. J Med Chem57:3522-31 (2014) 
 
Carbonic anhydrase 9
Name:Carbonic anhydrase 9
Type:Enzyme
Mol. Mass.:49669.03
Organism:Homo sapiens (Human)
Description:Catalytic domain of human cloned isozyme was used in the assay
Residue:459
BDBM50004515
NameBDBM50004515
Synonyms:CHEMBL3233395
TypeSmall organic molecule
Emp. Form.C16H18N4O9S
Mol. Mass.442.401
SMILESOC[C@H]1O[C@@H](OCc2cn(nn2)-c2ccc3C(=O)NS(=O)(=O)c3c2)[C@H](O)[C@@H](O)[C@@H]1O