Reaction Details
TargetCarbonic anhydrase 12
LigandBDBM50004484
Substrate/Competitorn/a
Meas. Tech.ChEMBL_1337410 (CHEMBL3241555)
Ki 15600±n/a nM
Citation Moeker, JPeat, TSBornaghi, LFVullo, DSupuran, CTPoulsen, SA Cyclic secondary sulfonamides: unusually good inhibitors of cancer-related carbonic anhydrase enzymes. J Med Chem57:3522-31 (2014) 
 
Carbonic anhydrase 12
Name:Carbonic anhydrase 12
Type:Enzyme
Mol. Mass.:39456.00
Organism:Homo sapiens (Human)
Description:Catalytic domain of human cloned isozyme was used in the assay
Residue:354
BDBM50004484
NameBDBM50004484
Synonyms:CHEMBL3233386
TypeSmall organic molecule
Emp. Form.C7H4N2O5S
Mol. Mass.228.182
SMILES[O-][N+](=O)c1ccc2C(=O)NS(=O)(=O)c2c1