Reaction Details
TargetCarbonic anhydrase 12
LigandBDBM50004509
Substrate/Competitorn/a
Meas. Tech.ChEMBL_1337410 (CHEMBL3241555)
Ki 57±n/a nM
Citation Moeker, JPeat, TSBornaghi, LFVullo, DSupuran, CTPoulsen, SA Cyclic secondary sulfonamides: unusually good inhibitors of cancer-related carbonic anhydrase enzymes. J Med Chem57:3522-31 (2014) 
 
Carbonic anhydrase 12
Name:Carbonic anhydrase 12
Type:Enzyme
Mol. Mass.:39456.00
Organism:Homo sapiens (Human)
Description:Catalytic domain of human cloned isozyme was used in the assay
Residue:354
BDBM50004509
NameBDBM50004509
Synonyms:CHEMBL3233389
TypeSmall organic molecule
Emp. Form.C16H12N4O3S
Mol. Mass.340.356
SMILESCc1cccc(c1)-c1cn(nn1)-c1ccc2C(=O)NS(=O)(=O)c2c1